ApprenticePayer
type: PayerType
type: NamedIndividual

Enrolment
label: Inscription @fr
comment: An event which corresponds to the enrolment of an apprenticship. In the Garzoni project, it corresponds to the registration of the contract at the institution of the Giustizia Vecchia.
type: EventType
type: NamedIndividual

Charge
comment: A public responsibility hold by a person, usually different from his/her profession.
subclass of: Entity
type: Class

OtherPayer
type: PayerType
type: NamedIndividual

Master
comment: A role or function which a person has while being a master duting an apprenticship.
type: RoleType
type: NamedIndividual

ApplicationRule
comment: The definition of the conditions under which a rule applies.
subclass of: Type
equivalent class: Class
  one of: SanoApplication
  one of: SanoInfermoApplication
type: Class

hasLocation
comment: This property allows to specify the location of an entity
domain: WorkshopMention
sub property of: topObjectProperty
type: ObjectProperty

hasGeographicalOrigin
comment: This property allows to specific the geographical origins of a PersonMention or PersonEntity.
type: ObjectProperty

clothingType
comment: An indication on the type of clothes which is being paid to an apprentice.
range: string
domain: HostingCondition
type: DatatypeProperty

PlaceType
comment: The type of place.
subclass of: Type
equivalent class: Class
  one of: City
  one of: Country
  one of: Region
  one of: RuralArea
type: Class

Ducati
type: CurrencyType
type: NamedIndividual

FinancialCondition
comment: The financial terms of a contract.
subclass of: Condition
equivalent class: Restriction
  all values from: FinancialConditionType.
  on property: conditionType
type: Class

PersonalCare
type: HostingConditionType
type: NamedIndividual

quondam2
comment: This property allows to state the status of the second quondam information in an Appellation.
range: boolean
domain: PersonAppellation
type: FunctionalProperty
type: DatatypeProperty

Condition
comment: Any condition or terms stated in a apprenticeship contract.
type: Class

Country
type: PlaceType
type: NamedIndividual

Accommodation
type: HostingConditionType
type: NamedIndividual

EventType
comment: The type of event.
subclass of: Type
equivalent class: Class
  one of: Apprenticeship
  one of: BreachofContract
  one of: Enrolment
  one of: Flee
type: Class

Firstname
label: Prénom @fr
comment: The firstname of a person.
subclass of: AppellationComponent
type: Class

Other
comment: An undetermined role or function taht a person has.
type: RoleType
type: NamedIndividual

Flee
label: Fugue @fr
comment: An event which corresponds to the flee of an apprentice during its apprenticeship.
type: EventType
type: NamedIndividual

WeeklyPeriod
type: PeriodizationType
type: NamedIndividual

conditionType
comment: This property allows to state the specific type of a financial or hosting condition.
domain: Condition
type: FunctionalProperty
type: ObjectProperty

Patronym1
label: Patronyme1 @fr
comment: Part of the name of a person which refers to one of his/her immediate relative. In (former) Italian family names, the patronymic is preceded by the word "di" or "quondam", e.g. "Federico Di Garla". "Di" stands for "figlio/figlia di" or "marito/moglie di" meaning the son/daughter or husband/wife of a living person. "Quondam" means the same but for a person who ceased to live.
subclass of: AppellationComponent
type: Class

ChargeMention
comment: The mention of a Charge.
subclass of: Mention
type: Class

Mention
type: Class

Region
type: PlaceType
type: NamedIndividual

identifiedPerson
comment: To be deleted, only in MediaWiki.
range: string
type: DatatypeProperty

oid
comment: This property allows to state the object id of the mongo database (only valid for data coming from MediaWiki, should disappear.)
domain: Contract
type: DatatypeProperty

ageText
comment: To be deleted, only in MediaWiki
range: string
type: DatatypeProperty

suggestedProfessionCategory
type: DatatypeProperty

ProfessionMention
comment: The mention of the profession of a person.
subclass of: Mention
type: Class

partialAmount
comment: The partial amount of a progressive salary.
range: integer
domain: FinancialCondition
type: DatatypeProperty

RoleType
comment: The type of role.
subclass of: Type
equivalent class: Class
  one of: Apprentice
  one of: Guarantor
  one of: Master
  one of: Other
type: Class

WorkshopMention
comment: The mention of a workshop.
subclass of: Mention
type: Class

denunciationDate
comment: This property allows to state at which date a flee has been denounced.
type: DatatypeProperty

Clothing
type: HostingConditionType
type: NamedIndividual

period
comment: The period during which something happens.
range: string
domain: HostingCondition
domain: FinancialCondition
type: DatatypeProperty

insigna
comment: This property allows to state the emblem or 'name' of a workshop.
range: string
domain: WorkshopMention
type: DatatypeProperty

BreachofContract
label: Rupture de contrat @fr
comment: An event which corresponds to the breaking of a contract.
type: EventType
type: NamedIndividual

'Other_(currency)'
type: CurrencyType
type: NamedIndividual

hasCondition
comment: This property allows to assign a condition to a garzoni contract.
range: Condition
domain: Contract
inverse of: isConditionOf
type: ObjectProperty

Collectivename
label: Nom collectif @fr
comment: In Garzoni context, this class covers expressions used to refer to collective entities. Typical examples include: "et fratelli" (and brothers), "e fioli", "et sua consorte" .
subclass of: AppellationComponent
type: Class

Contract
label: Contrat @fr
comment: A legal agreement between parties that set up the conditions of an employment. In the Garzoni project, this corresponds to an apprenticeship contract between a master and an apprentice with, often, the caution of a guarantor.
subclass of: Source
type: Class

mediaWikiReference
comment: This property allows to link a contract to its corresponding object contract in the former MediaWiki database.
type: DatatypeProperty

Profession
comment: Activity in which someone is skilled and which is carries out in order to make a living. Occupation.
subclass of: Entity
type: Class

id
type: DatatypeProperty

AnnualPeriod
type: PeriodizationType
type: NamedIndividual

SanoInfermoApplication
type: ApplicationRule
type: NamedIndividual

GenericExpenses
type: HostingConditionType
type: NamedIndividual

OtherSalary
type: FinancialConditionType.
type: NamedIndividual

WholePeriod
type: PeriodizationType
type: NamedIndividual

Soldi
type: CurrencyType
type: NamedIndividual

Workshop
label: Atelier @fr
comment: The place where objects are crafted or manufactured. In garzoni context, the place were the training of the apprentice was taking place.
subclass of: Entity
type: Class

SemestralPeriod
type: PeriodizationType
type: NamedIndividual

Apprentice
comment: A role or function which a person has when being enrolled as apprentice during an apprenticeship.
type: RoleType
type: NamedIndividual

Garzoni Ontology
version info: 1.0
comment: An ontology which models the information contained in the archival series "Accordi dei Garzoni" of the Venetian State Archives, relative to early modern venetian apprenticeship domain.
type: Ontology

Type
type: Class

SanoApplication
type: ApplicationRule
type: NamedIndividual

CurrencyType
comment: The type of currency.
subclass of: Type
equivalent class: Class
  one of: Ducati
  one of: Lire
  one of: Soldi
  one of: 'Other_(currency)'
type: Class

Entity
type: Class

onMultiplePages
comment: This property allows to state whether a contract spans over 2 pages or not.
range: boolean
domain: Contract
type: DatatypeProperty

site
comment: This property allows to state a complementary information relative to the location of a worshop.
type: DatatypeProperty

PayerType
comment: The type of payer; in garzoni context, this is used to specify who is paying the apprenticeship: the apperntice to the master (emphasize on training), or the master to the apprentice (emphasize on employing).
subclass of: Type
equivalent class: Class
  one of: ApprenticePayer
  one of: MasterPayer
  one of: OtherPayer
type: Class

hasName
comment: This property is used to attribute a PersonAppellation to a PersonMention or a PersonEntity.
range: PersonAppellation
type: ObjectProperty

HostingCondition
comment: The contract's terms relative to hosting, i.e. some benefit in kind.
subclass of: Condition
equivalent class: Restriction
  all values from: HostingConditionType
  on property: conditionType
type: Class

Periodization
comment: The regular time period at which something happens.
range: Datatype
  one of: annual
  one of: daily
  one of: monthly
  one of: none
  one of: semestral
  one of: weekly
  one of: whole period
domain: HostingCondition
domain: FinancialCondition
type: DatatypeProperty

Lire
type: CurrencyType
type: NamedIndividual

Pledge
type: FinancialConditionType.
type: NamedIndividual

MasterPayer
type: PayerType
type: NamedIndividual

isWorkshopOf
domain: WorkshopMention
type: ObjectProperty

Patronymic2
comment: Part of the name of a person which refers to one of his/her relative. In (former) Italian family names, the patronymic is preceded by the word "di" or "quondam", e.g. "Federico Di Garla". "Di" stands for "figlio/figlia di" or "marito/moglie di" meaning the son/daughter or husband/wife of a living person. "Quondam" means the same but for a person who ceased to live.
subclass of: AppellationComponent
type: Class

hasNextPart
comment: This property allows to relate the different parts of a contract spanning over 2 pages.
type: ObjectProperty

hasRole
is defined by: This property specifies the role of a PersonMention or PersonEntity.
type: ObjectProperty

hasWorkshop
comment: The relation between a PersonMention or PersonEntity and a Workshop.
inverse of: isWorkshopOf
type: ObjectProperty

FinancialConditionType.
comment: The type of financial condition.
subclass of: Type
equivalent class: Class
  one of: Pledge
  one of: SingleSalary
type: Class

hasProfession
comment: This property allows to state the profession of a PersonMention or PersonEntity.
type: ObjectProperty

Guarantor
comment: A role or function that a person has while being a guarantor in the context of an apprenticeship.
type: RoleType
type: NamedIndividual

isConditionOf
range: Contract
domain: Condition
type: FunctionalProperty
type: ObjectProperty

hasMargin
comment: This property allows to state whether a contract, in the register where it is written, has a complementary note in the margin or not.
range: boolean
domain: Contract
type: DatatypeProperty

moneyInformation
comment: Additional information about money, if necessary.
range: string
domain: FinancialCondition
type: DatatypeProperty

totalAmount
range: integer
domain: FinancialCondition
type: DatatypeProperty

quondam1
comment: This property allows to state the status of the first quondam information in an Appellation. If 'di', then false, otherwise true.
range: boolean
domain: PersonAppellation
type: FunctionalProperty
type: DatatypeProperty

MonthlyPeriod
type: PeriodizationType
type: NamedIndividual

worksFor
comment: This allow to state an additional information related to a ProfessionMention.
range: string
type: DatatypeProperty

AppellationComponent
label: Composant d'appellation @fr
comment: This class defines elements which compose the appellation, or name, of an entity.
type: Class

HostingConditionType
comment: The type of hosting condition.
subclass of: Type
equivalent class: Class
  one of: Accommodation
  one of: Clothing
  one of: GenericExpenses
  one of: PersonalCare
type: Class

PersonAppellation
comment: The name of a person entity.
type: Class

Source
type: Class

professionCategory
range: string
domain: ProfessionMention
type: DatatypeProperty

PeriodizationType
comment: The type of periodization; in garzoni context, this is used to specify at which intervals the salary is paid.
subclass of: Type
equivalent class: Class
  one of: AnnualPeriod
  one of: DailyPeriod
  one of: MonthlyPeriod
  one of: SemestralPeriod
  one of: WeeklyPeriod
  one of: WholePeriod
type: Class

applicationRule
comment: This property allows to state the condition under which a rule is applied.
range: Datatype
  one of: none
  one of: sano
  one of: sano et infermo
domain: HostingCondition
type: DatatypeProperty

Apprenticeship
label: Apprentissage @fr
comment: An event which corresponds to the execution of an apprenticeship.
type: EventType
type: NamedIndividual

SingleSalary
comment: In a professional contractual setting, a fixed regular payment due by an employer to an employee.
type: FinancialConditionType.
type: NamedIndividual

placeType
type: ObjectProperty

ProgressiveSalary
type: FinancialConditionType.
type: NamedIndividual

RuralArea
type: PlaceType
type: NamedIndividual

paidInGoods
range: boolean
domain: HostingCondition
domain: FinancialCondition
type: DatatypeProperty

details
comment: This property allows to state additionnal details about whatever.
range: string
sub property of: topDataProperty
type: DatatypeProperty

hasCharge
comment: This property allows to assign a charge to a PersonMention or a PersonEntity.
type: ObjectProperty

paidBy
range: Datatype
  one of: apprentice
  one of: master
  one of: nobody
  one of: other
domain: HostingCondition
domain: FinancialCondition
type: DatatypeProperty

currencyUnit
comment: To be deleted when harmonization with Wiki fully done.
type: DatatypeProperty

City
type: PlaceType
type: NamedIndividual

Surname
label: Nom de famille @fr
comment: The surname or family name of a person entity.
subclass of: AppellationComponent
type: Class

hasResidence
comment: This property allows to specify the residence of a PersonMention or PersonEntity.
type: ObjectProperty

isNextPartOf
range: Contract
domain: Contract
type: ObjectProperty

DailyPeriod
type: PeriodizationType
type: NamedIndividual